Reaction Details
TargetDelta-type opioid receptor
LigandBDBM50306295
Substrate/Competitorn/a
Meas. Tech.ChEMBL_607037 (CHEMBL1074665)
Ki 7±n/a nM
Citation Liras, SMcHardy, SFAllen, MPSegelstein, BEHeck, SDBryce, DKSchmidt, AWVanase-Frawley, MCallegari, EMcLean, S Biaryl piperidines as potent and selective delta opioid receptor ligands. Bioorg Med Chem Lett20:503-7 (2010) 
 
Delta-type opioid receptor
Name:Delta-type opioid receptor
Type:G Protein-Coupled Receptor (GPCR)
Mol. Mass.:40382.98
Organism:Homo sapiens (Human)
Description:Competition binding assays were carried out using membrane preparations from transfected HN9.10 cells that constitutively expressed the delta opioid receptor.
Residue:372
BDBM50306295
NameBDBM50306295
Synonyms:4-(3-(3-carbamoylphenyl)-1-(thiazol-2-ylmethyl)piperidin-3-yl)-N,N-diethylbenzamide | CHEMBL594301
TypeSmall organic molecule
Emp. Form.C27H32N4O2S
Mol. Mass.476.634
SMILESCCN(CC)C(=O)c1ccc(cc1)C1(CCCN(Cc2nccs2)C1)c1cccc(c1)C(N)=O