Reaction Details
TargetDelta-type opioid receptor
LigandBDBM50306300
Substrate/Competitorn/a
Meas. Tech.ChEMBL_607041 (CHEMBL1074669)
IC50 72±n/a nM
Citation Liras, SMcHardy, SFAllen, MPSegelstein, BEHeck, SDBryce, DKSchmidt, AWVanase-Frawley, MCallegari, EMcLean, S Biaryl piperidines as potent and selective delta opioid receptor ligands. Bioorg Med Chem Lett20:503-7 (2010) 
 
Delta-type opioid receptor
Name:Delta-type opioid receptor
Type:G Protein-Coupled Receptor (GPCR)
Mol. Mass.:40382.98
Organism:Homo sapiens (Human)
Description:Competition binding assays were carried out using membrane preparations from transfected HN9.10 cells that constitutively expressed the delta opioid receptor.
Residue:372
BDBM50306300
NameBDBM50306300
Synonyms:4-(4-(3-hydroxyphenyl)-1-(2-methylpentyl)piperidin-4-yl)-N,N-dimethylbenzamide | CHEMBL603428
TypeSmall organic molecule
Emp. Form.C26H36N2O2
Mol. Mass.408.5762
SMILESCCCC(C)CN1CCC(CC1)(c1ccc(cc1)C(=O)N(C)C)c1cccc(O)c1