Reaction Details
TargetMu-type opioid receptor
LigandBDBM50306293
Substrate/Competitorn/a
Meas. Tech.ChEMBL_607038 (CHEMBL1074666)
Ki>890±n/a nM
Citation Liras, SMcHardy, SFAllen, MPSegelstein, BEHeck, SDBryce, DKSchmidt, AWVanase-Frawley, MCallegari, EMcLean, S Biaryl piperidines as potent and selective delta opioid receptor ligands. Bioorg Med Chem Lett20:503-7 (2010) 
 
Mu-type opioid receptor
Name:Mu-type opioid receptor
Type:G Protein-Coupled Receptor (GPCR)
Mol. Mass.:44789.51
Organism:Homo sapiens (Human)
Description:P35372
Residue:400
BDBM50306293
NameBDBM50306293
Synonyms:4-(1-((1H-imidazol-2-yl)methyl)-3-(3-hydroxyphenyl)piperidin-3-yl)-N,N-diethylbenzamide | CHEMBL605930
TypeSmall organic molecule
Emp. Form.C26H32N4O2
Mol. Mass.432.5579
SMILESCCN(CC)C(=O)c1ccc(cc1)C1(CCCN(Cc2ncc[nH]2)C1)c1cccc(O)c1