Reaction Details
TargetKappa-type opioid receptor
LigandBDBM50306292
Substrate/Competitorn/a
Meas. Tech.ChEMBL_607039 (CHEMBL1074667)
Ki 163±n/a nM
Citation Liras, SMcHardy, SFAllen, MPSegelstein, BEHeck, SDBryce, DKSchmidt, AWVanase-Frawley, MCallegari, EMcLean, S Biaryl piperidines as potent and selective delta opioid receptor ligands. Bioorg Med Chem Lett20:503-7 (2010) 
 
Kappa-type opioid receptor
Name:Kappa-type opioid receptor
Type:G Protein-Coupled Receptor (GPCR)
Mol. Mass.:42648.76
Organism:Homo sapiens (Human)
Description:P41145
Residue:380
BDBM50306292
NameBDBM50306292
Synonyms:CHEMBL605735 | N,N-diethyl-4-(3-(3-hydroxyphenyl)-1-(thiazol-2-ylmethyl)piperidin-3-yl)benzamide
TypeSmall organic molecule
Emp. Form.C26H31N3O2S
Mol. Mass.449.608
SMILESCCN(CC)C(=O)c1ccc(cc1)C1(CCCN(Cc2nccs2)C1)c1cccc(O)c1