Reaction Details
TargetKappa-type opioid receptor
LigandBDBM50306294
Substrate/Competitorn/a
Meas. Tech.ChEMBL_607039 (CHEMBL1074667)
Ki 41±n/a nM
Citation Liras, SMcHardy, SFAllen, MPSegelstein, BEHeck, SDBryce, DKSchmidt, AWVanase-Frawley, MCallegari, EMcLean, S Biaryl piperidines as potent and selective delta opioid receptor ligands. Bioorg Med Chem Lett20:503-7 (2010) 
 
Kappa-type opioid receptor
Name:Kappa-type opioid receptor
Type:G Protein-Coupled Receptor (GPCR)
Mol. Mass.:42648.76
Organism:Homo sapiens (Human)
Description:P41145
Residue:380
BDBM50306294
NameBDBM50306294
Synonyms:3-(1-(cyclopropylmethyl)-3-(4-(2-hydroxypropan-2-yl)phenyl)piperidin-3-yl)phenol | CHEMBL595233
TypeSmall organic molecule
Emp. Form.C24H31NO2
Mol. Mass.365.5084
SMILESCC(C)(O)c1ccc(cc1)C1(CCCN(CC2CC2)C1)c1cccc(O)c1