Reaction Details
TargetD(1A) dopamine receptor
LigandBDBM50306327
Substrate/Competitorn/a
Meas. Tech.ChEMBL_609554 (CHEMBL1073807)
Ki 2.8±n/a nM
Citation Qiang, LSasikumar, TKBurnett, DASu, JTang, HYe, YMazzola, RDZhu, ZMcKittrick, BAGreenlee, WJFawzi, ASmith, MZhang, HLachowicz, JE Discovery of new SCH 39166 analogs as potent and selective dopamine D1 receptor antagonists. Bioorg Med Chem Lett20:836-40 (2010) 
 
D(1A) dopamine receptor
Name:D(1A) dopamine receptor
Type:Enzyme
Mol. Mass.:49303.43
Organism:Homo sapiens (Human)
Description:P21728
Residue:446
BDBM50306327
NameBDBM50306327
Synonyms:(6aS,13bS)-4-amino-11-chloro-7-methyl-6,6a,7,8,9,13b-hexahydro-5H-benzo[d]naphtho[2,1-b]azepin-12-ol | CHEMBL591685
TypeSmall organic molecule
Emp. Form.C19H21ClN2O
Mol. Mass.328.836
SMILESCN1CCc2cc(Cl)c(O)cc2[C@@H]2[C@@H]1CCc1c(N)cccc21