Reaction Details
TargetD(2) dopamine receptor
LigandBDBM50306321
Substrate/Competitorn/a
Meas. Tech.ChEMBL_609556 (CHEMBL1073809)
Ki>10000±n/a nM
Citation Qiang, LSasikumar, TKBurnett, DASu, JTang, HYe, YMazzola, RDZhu, ZMcKittrick, BAGreenlee, WJFawzi, ASmith, MZhang, HLachowicz, JE Discovery of new SCH 39166 analogs as potent and selective dopamine D1 receptor antagonists. Bioorg Med Chem Lett20:836-40 (2010) 
 
D(2) dopamine receptor
Name:D(2) dopamine receptor
Type:Cell-surface receptors
Mol. Mass.:50647.10
Organism:Homo sapiens (Human)
Description:P14416
Residue:443
BDBM50306321
NameBDBM50306321
Synonyms:CHEMBL598516 | N-((6aS,13bR)-11-chloro-12-hydroxy-7-methyl-6,6a,7,8,9,13b-hexahydro-5H-benzo[d]naphtho[2,1-b]azepin-3-yl)cyclopropanecarboxamide
TypeSmall organic molecule
Emp. Form.C23H25ClN2O2
Mol. Mass.396.91
SMILESCN1CCc2cc(Cl)c(O)cc2[C@@H]2[C@@H]1CCc1cc(NC(=O)C3CC3)ccc21