Reaction Details
TargetEpidermal growth factor receptor
LigandBDBM50306684
Substrate/Competitorn/a
Meas. Tech.ChEMBL_611562 (CHEMBL1066406)
IC50>50000±n/a nM
Citation Nishii, HChiba, TMorikami, KFukami, TASakamoto, HKo, KKoyano, H Discovery of 6-benzyloxyquinolines as c-Met selective kinase inhibitors. Bioorg Med Chem Lett20:1405-9 (2010) 
 
Epidermal growth factor receptor
Name:Epidermal growth factor receptor
Type:Receptor Kinase Domain
Mol. Mass.:134279.59
Organism:Homo sapiens (Human)
Description:P00533
Residue:1210
BDBM50306684
NameBDBM50306684
Synonyms:2-(6-((R)-1-(2,6-dichloro-3-fluorophenyl)ethoxy)quinolin-3-yl)cyclopropanecarboxamide | CHEMBL602472
TypeSmall organic molecule
Emp. Form.C21H17Cl2FN2O2
Mol. Mass.419.276
SMILESC[C@@H](Oc1ccc2ncc(cc2c1)C1CC1C(N)=O)c1c(Cl)ccc(F)c1Cl