Reaction Details
TargetBeta-1 adrenergic receptor
LigandBDBM86453
Substrate/Competitorn/a
Meas. Tech.ChEMBL_611945 (CHEMBL1071506)
EC50 86±n/a nM
Citation Bouyssou, THoenke, CRudolf, KLustenberger, PPestel, SSieger, PLotz, RHeine, CBüttner, FHSchnapp, AKonetzki, I Discovery of olodaterol, a novel inhaled beta2-adrenoceptor agonist with a 24 h bronchodilatory efficacy. Bioorg Med Chem Lett20:1410-4 (2010) 
 
Beta-1 adrenergic receptor
Name:Beta-1 adrenergic receptor
Type:G Protein-Coupled Receptor (GPCR)
Mol. Mass.:51338.40
Organism:Homo sapiens (Human)
Description:P08588
Residue:477
BDBM86453
NameBDBM86453
Synonyms:CAS_73573-87-2 NSC_3083544
TypeSmall organic molecule
Emp. Form.C19H24N2O4
Mol. Mass.344.4049
SMILESCOc1ccc(CC(C)NCC(O)c2ccc(O)c(NC=O)c2)cc1