Reaction Details
TargetCoagulation factor X
LigandBDBM50307099
Substrate/Competitorn/a
Meas. Tech.ChEMBL_609369 (CHEMBL1072755)
Ki 0.84±n/a nM
Citation Quan, MLPinto, DJRossi, KASheriff, SAlexander, RSAmparo, EKish, KKnabb, RMLuettgen, JMMorin, PSmallwood, AWoerner, FJWexler, RR Phenyltriazolinones as potent factor Xa inhibitors. Bioorg Med Chem Lett20:1373-7 (2010) 
 
Coagulation factor X
Name:Coagulation factor X
Type:Enzyme
Mol. Mass.:54726.60
Organism:Homo sapiens (Human)
Description:n/a
Residue:488
BDBM50307099
NameBDBM50307099
Synonyms:(R)-6-(2'-((3-hydroxypyrrolidin-1-yl)methyl)biphenyl-4-yl)-1-(3-(5-oxo-4,5-dihydro-1h-1,2,4-triazol-3-yl)phenyl)-3-(trifluoromethyl)-5,6-dihydro-1h-pyrazolo[3,4-c]pyridin-7(4h)-one CHEMBL577677
TypeSmall organic molecule
Emp. Form.C32H28F3N7O3
Mol. Mass.615.605
SMILESO[C@@H]1CCN(Cc2ccccc2-c2ccc(cc2)N2CCc3c(nn(c3C2=O)-c2cccc(c2)-c2n[nH]c(=O)[nH]2)C(F)(F)F)C1