Reaction Details
TargetCoagulation factor X
LigandBDBM50307102
Substrate/Competitorn/a
Meas. Tech.ChEMBL_609369 (CHEMBL1072755)
Ki 0.25±n/a nM
Citation Quan, MLPinto, DJRossi, KASheriff, SAlexander, RSAmparo, EKish, KKnabb, RMLuettgen, JMMorin, PSmallwood, AWoerner, FJWexler, RR Phenyltriazolinones as potent factor Xa inhibitors. Bioorg Med Chem Lett20:1373-7 (2010) 
 
Coagulation factor X
Name:Coagulation factor X
Type:Enzyme
Mol. Mass.:54726.60
Organism:Homo sapiens (Human)
Description:n/a
Residue:488
BDBM50307102
NameBDBM50307102
Synonyms:7-oxo-1-(3-(5-oxo-4,5-dihydro-1H-1,2,4-triazol-3-yl)phenyl)-6-(2'-(pyrrolidin-1-ylmethyl)biphenyl-4-yl)-3a,4,5,6,7,7a-hexahydro-1H-pyrazolo[3,4-c]pyridine-3-carboxamide | CHEMBL579107
TypeSmall organic molecule
Emp. Form.C32H30N8O3
Mol. Mass.574.6324
SMILESNC(=O)c1nn(c2c1CCN(C2=O)c1ccc(cc1)-c1ccccc1CN1CCCC1)-c1cccc(c1)-c1n[nH]c(=O)[nH]1