Reaction Details
Target5-hydroxytryptamine receptor 7
LigandBDBM50150676
Substrate/Competitorn/a
Meas. Tech.ChEMBL_611967 (CHEMBL1072174)
Ki 3.38±n/a nM
Citation Badarau, EBugno, RSuzenet, FBojarski, AJFinaru, ALGuillaumet, G SAR studies on new bis-aryls 5-HT7 ligands: Synthesis and molecular modeling. Bioorg Med Chem18:1958-67 (2010) 
 
5-hydroxytryptamine receptor 7
Name:5-hydroxytryptamine receptor 7
Type:G Protein-Coupled Receptor (GPCR)
Mol. Mass.:53573.08
Organism:Homo sapiens (Human)
Description:P34969
Residue:479
BDBM50150676
NameBDBM50150676
Synonyms:((R)-8-Phenyl-chroman-3-yl)-dipropyl-amine CHEMBL186112
TypeSmall organic molecule
Emp. Form.C21H27NO
Mol. Mass.309.4452
SMILESCCCN(CCC)[C@H]1COc2c(C1)cccc2-c1ccccc1