Reaction Details
TargetExtracellular calcium-sensing receptor
LigandBDBM50308074
Substrate/Competitorn/a
Meas. Tech.ChEMBL_610755 (CHEMBL1064390)
IC50 2700±n/a nM
Citation Widler, LAltmann, EBeerli, RBreitenstein, WBouhelal, RBuhl, TGamse, RGerspacher, MHalleux, CJohn, MRLehmann, HKalb, OKneissel, MMissbach, MMüller, IRReidemeister, SRenaud, JTaillardat, ATommasi, RWeiler, SWolf, RMSeuwen, K 1-Alkyl-4-phenyl-6-alkoxy-1H-quinazolin-2-ones: a novel series of potent calcium-sensing receptor antagonists. J Med Chem53:2250-63 (2010) 
 
Extracellular calcium-sensing receptor
Name:Extracellular calcium-sensing receptor
Type:Protein
Mol. Mass.:120663.13
Organism:Homo sapiens (Human)
Description:P41180
Residue:1078
BDBM50308074
NameBDBM50308074
Synonyms:6-Isopropoxy-1-isopropyl-4-(4-isopropyl-phenyl)-1H-quinazolin-2-one | CHEMBL599025
TypeSmall organic molecule
Emp. Form.C23H28N2O2
Mol. Mass.364.4806
SMILESCC(C)Oc1ccc2n(C(C)C)c(=O)nc(-c3ccc(cc3)C(C)C)c2c1