Reaction Details
TargetExtracellular calcium-sensing receptor
LigandBDBM50308082
Substrate/Competitorn/a
Meas. Tech.ChEMBL_610755 (CHEMBL1064390)
IC50 4.2±n/a nM
Citation Widler, LAltmann, EBeerli, RBreitenstein, WBouhelal, RBuhl, TGamse, RGerspacher, MHalleux, CJohn, MRLehmann, HKalb, OKneissel, MMissbach, MMüller, IRReidemeister, SRenaud, JTaillardat, ATommasi, RWeiler, SWolf, RMSeuwen, K 1-Alkyl-4-phenyl-6-alkoxy-1H-quinazolin-2-ones: a novel series of potent calcium-sensing receptor antagonists. J Med Chem53:2250-63 (2010) 
 
Extracellular calcium-sensing receptor
Name:Extracellular calcium-sensing receptor
Type:Protein
Mol. Mass.:120663.13
Organism:Homo sapiens (Human)
Description:P41180
Residue:1078
BDBM50308082
NameBDBM50308082
Synonyms:1-(4-Ethyl-benzyl)-4-(4-isopropyl-phenyl)-6-propargyloxy-1H-quinazolin-2-one | CHEMBL597400
TypeSmall organic molecule
Emp. Form.C29H28N2O2
Mol. Mass.436.5448
SMILESCCc1ccc(Cn2c3ccc(OCC#C)cc3c(nc2=O)-c2ccc(cc2)C(C)C)cc1