Reaction Details
TargetExtracellular calcium-sensing receptor
LigandBDBM50308091
Substrate/Competitorn/a
Meas. Tech.ChEMBL_610755 (CHEMBL1064390)
IC50 3.4±n/a nM
Citation Widler, LAltmann, EBeerli, RBreitenstein, WBouhelal, RBuhl, TGamse, RGerspacher, MHalleux, CJohn, MRLehmann, HKalb, OKneissel, MMissbach, MMüller, IRReidemeister, SRenaud, JTaillardat, ATommasi, RWeiler, SWolf, RMSeuwen, K 1-Alkyl-4-phenyl-6-alkoxy-1H-quinazolin-2-ones: a novel series of potent calcium-sensing receptor antagonists. J Med Chem53:2250-63 (2010) 
 
Extracellular calcium-sensing receptor
Name:Extracellular calcium-sensing receptor
Type:Protein
Mol. Mass.:120663.13
Organism:Homo sapiens (Human)
Description:P41180
Residue:1078
BDBM50308091
NameBDBM50308091
Synonyms:CHEMBL597194 | {3-[4-(4-Isopropyl-phenyl)-2-oxo-6-propargyloxy-2H-quinazolin-1-ylmethyl]-phenoxy}-acetic acid
TypeSmall organic molecule
Emp. Form.C29H26N2O5
Mol. Mass.482.5271
SMILESCC(C)c1ccc(cc1)-c1nc(=O)n(Cc2cccc(OCC(O)=O)c2)c2ccc(OCC#C)cc12