Reaction Details
TargetExtracellular calcium-sensing receptor
LigandBDBM50308108
Substrate/Competitorn/a
Meas. Tech.ChEMBL_610755 (CHEMBL1064390)
IC50 2.5±n/a nM
Citation Widler, LAltmann, EBeerli, RBreitenstein, WBouhelal, RBuhl, TGamse, RGerspacher, MHalleux, CJohn, MRLehmann, HKalb, OKneissel, MMissbach, MMüller, IRReidemeister, SRenaud, JTaillardat, ATommasi, RWeiler, SWolf, RMSeuwen, K 1-Alkyl-4-phenyl-6-alkoxy-1H-quinazolin-2-ones: a novel series of potent calcium-sensing receptor antagonists. J Med Chem53:2250-63 (2010) 
 
Extracellular calcium-sensing receptor
Name:Extracellular calcium-sensing receptor
Type:Protein
Mol. Mass.:120663.13
Organism:Homo sapiens (Human)
Description:P41180
Residue:1078
BDBM50308108
NameBDBM50308108
Synonyms:1-Benzyl-5-cyclopropylmethyl-6-hydroxy-4-(4-isopropyl-phenyl)-1H-quinazolin-2-one | CHEMBL597208
TypeSmall organic molecule
Emp. Form.C28H28N2O2
Mol. Mass.424.5341
SMILESCC(C)c1ccc(cc1)-c1nc(=O)n(Cc2ccccc2)c2ccc(O)c(CC3CC3)c12