Reaction Details
TargetProstaglandin D2 receptor 2
LigandBDBM50308134
Substrate/Competitorn/a
Meas. Tech.ChEMBL_610068 (CHEMBL1072477)
Ki>628±n/a nM
Citation Blouin, MHan, YBurch, JFarand, JMellon, CGaudreault, MWrona, MLévesque, JFDenis, DMathieu, MCStocco, RVigneault, ETherien, AClark, PRowland, SXu, DO'Neill, GDucharme, YFriesen, R The discovery of 4-{1-[({2,5-dimethyl-4-[4-(trifluoromethyl)benzyl]-3-thienyl}carbonyl)amino]cyclopropyl}benzoic acid (MK-2894), a potent and selective prostaglandin E2 subtype 4 receptor antagonist. J Med Chem53:2227-38 (2010) 
 
Prostaglandin D2 receptor 2
Name:Prostaglandin D2 receptor 2
Type:Enzyme
Mol. Mass.:43295.45
Organism:Homo sapiens (Human)
Description:Q9Y5Y4
Residue:395
BDBM50308134
NameBDBM50308134
Synonyms:4-[({[2,5-Dichloro-4-(3-chlorobenzyl)-3-thienyl]carbonyl}amino)methyl]benzoic acid | CHEMBL601299
TypeSmall organic molecule
Emp. Form.C20H14Cl3NO3S
Mol. Mass.454.754
SMILESOC(=O)c1ccc(CNC(=O)c2c(Cl)sc(Cl)c2Cc2cccc(Cl)c2)cc1