Reaction Details
TargetProstaglandin E2 receptor EP1 subtype
LigandBDBM50308130
Substrate/Competitorn/a
Meas. Tech.ChEMBL_610065 (CHEMBL1072474)
Ki>4992±n/a nM
Citation Blouin, MHan, YBurch, JFarand, JMellon, CGaudreault, MWrona, MLévesque, JFDenis, DMathieu, MCStocco, RVigneault, ETherien, AClark, PRowland, SXu, DO'Neill, GDucharme, YFriesen, R The discovery of 4-{1-[({2,5-dimethyl-4-[4-(trifluoromethyl)benzyl]-3-thienyl}carbonyl)amino]cyclopropyl}benzoic acid (MK-2894), a potent and selective prostaglandin E2 subtype 4 receptor antagonist. J Med Chem53:2227-38 (2010) 
 
Prostaglandin E2 receptor EP1 subtype
Name:Prostaglandin E2 receptor EP1 subtype
Type:Enzyme
Mol. Mass.:41834.57
Organism:Homo sapiens (Human)
Description:P34995
Residue:402
BDBM50308130
NameBDBM50308130
Synonyms:4-{1-[({2,5-Dimethyl-4-[3-(trifluoromethyl)benzyl]-3-thienyl}-carbonyl)amino]cyclopropyl}benzoic Acid | CHEMBL603462
TypeSmall organic molecule
Emp. Form.C25H22F3NO3S
Mol. Mass.473.507
SMILESCc1sc(C)c(C(=O)NC2(CC2)c2ccc(cc2)C(O)=O)c1Cc1cccc(c1)C(F)(F)F