Reaction Details
TargetProstaglandin E2 receptor EP1 subtype
LigandBDBM50308133
Substrate/Competitorn/a
Meas. Tech.ChEMBL_610065 (CHEMBL1072474)
Ki>224±n/a nM
Citation Blouin, MHan, YBurch, JFarand, JMellon, CGaudreault, MWrona, MLévesque, JFDenis, DMathieu, MCStocco, RVigneault, ETherien, AClark, PRowland, SXu, DO'Neill, GDucharme, YFriesen, R The discovery of 4-{1-[({2,5-dimethyl-4-[4-(trifluoromethyl)benzyl]-3-thienyl}carbonyl)amino]cyclopropyl}benzoic acid (MK-2894), a potent and selective prostaglandin E2 subtype 4 receptor antagonist. J Med Chem53:2227-38 (2010) 
 
Prostaglandin E2 receptor EP1 subtype
Name:Prostaglandin E2 receptor EP1 subtype
Type:Enzyme
Mol. Mass.:41834.57
Organism:Homo sapiens (Human)
Description:P34995
Residue:402
BDBM50308133
NameBDBM50308133
Synonyms:4-[(1R)-1-({[2,5-Dichloro-4-(3-chlorobenzyl)-3-thienyl]carbonyl}amino)ethyl]benzoic acid | CHEMBL591431
TypeSmall organic molecule
Emp. Form.C21H16Cl3NO3S
Mol. Mass.468.781
SMILESC[C@@H](NC(=O)c1c(Cl)sc(Cl)c1Cc1cccc(Cl)c1)c1ccc(cc1)C(O)=O