Reaction Details
TargetProstaglandin F2-alpha receptor
LigandBDBM50308128
Substrate/Competitorn/a
Meas. Tech.ChEMBL_610071 (CHEMBL1072480)
Ki>2117±n/a nM
Citation Blouin, MHan, YBurch, JFarand, JMellon, CGaudreault, MWrona, MLévesque, JFDenis, DMathieu, MCStocco, RVigneault, ETherien, AClark, PRowland, SXu, DO'Neill, GDucharme, YFriesen, R The discovery of 4-{1-[({2,5-dimethyl-4-[4-(trifluoromethyl)benzyl]-3-thienyl}carbonyl)amino]cyclopropyl}benzoic acid (MK-2894), a potent and selective prostaglandin E2 subtype 4 receptor antagonist. J Med Chem53:2227-38 (2010) 
 
Prostaglandin F2-alpha receptor
Name:Prostaglandin F2-alpha receptor
Type:Enzyme
Mol. Mass.:40072.29
Organism:Homo sapiens (Human)
Description:P43088
Residue:359
BDBM50308128
NameBDBM50308128
Synonyms:4-[(1S)-1-({[4-(4-Chlorobenzyl)-2,5-dimethyl-3-thienyl]carbonyl}-amino)ethyl]benzoicAcid | CHEMBL599262
TypeSmall organic molecule
Emp. Form.C23H22ClNO3S
Mol. Mass.427.944
SMILESC[C@H](NC(=O)c1c(C)sc(C)c1Cc1ccc(Cl)cc1)c1ccc(cc1)C(O)=O