Reaction Details
Target5-hydroxytryptamine receptor 6
LigandBDBM78940
Substrate/Competitorn/a
Meas. Tech.ChEMBL_610399 (CHEMBL1073455)
IC50 2.4±n/a nM
Citation Haydar, SNYun, HAndrae, PMMattes, JZhang, JKramer, ASmith, DLHuselton, CGraf, RAschmies, SSchechter, LEComery, TARobichaud, AJ 5-Cyclic amine-3-arylsulfonylindazoles as novel 5-HT6 receptor antagonists. J Med Chem53:2521-7 (2010) 
 
5-hydroxytryptamine receptor 6
Name:5-hydroxytryptamine receptor 6
Type:G Protein-Coupled Receptor (GPCR)
Mol. Mass.:46968.43
Organism:Homo sapiens (Human)
Description:P50406
Residue:440
BDBM78940
NameBDBM78940
Synonyms:METHIOTHEPIN Methiothepin mesylate salt cid_3039995 methanesulfonic acid;1-methyl-4-(3-methylsulfanyl-5,6-dihydrobenzo[b][1]benzothiepin-5-yl)piperazine | methanesulfonic acid;1-methyl-4-[3-(methylthio)-5,6-dihydrobenzo[b][1]benzothiepin-5-yl]piperazine
TypeSmall organic molecule
Emp. Form.C20H24N2S2
Mol. Mass.356.548
SMILESCSc1ccc2Sc3ccccc3CC(N3CCN(C)CC3)c2c1