Reaction Details
TargetMatrix metalloproteinase-14
LigandBDBM50309147
Substrate/Competitorn/a
Meas. Tech.ChEMBL_608480 (CHEMBL1065141)
Ki 11000±n/a nM
Citation Rosner, KEGuo, ZOrth, PShipps, GWBelanger, DBChan, TYCurran, PJDai, CDeng, YGirijavallabhan, VMHong, LLavey, BJLee, JFLi, DLiu, ZPopovici-Muller, JTing, PCVaccaro, HWang, LWang, TYu, WZhou, GNiu, XSun, JKozlowski, JALundell, DJMadison, VMcKittrick, BPiwinski, JJShih, NYArshad Siddiqui, MStrickland, CO The discovery of novel tartrate-based TNF-alpha converting enzyme (TACE) inhibitors. Bioorg Med Chem Lett20:1189-93 (2010) 
 
Matrix metalloproteinase-14
Name:Matrix metalloproteinase-14
Type:Protein
Mol. Mass.:65900.19
Organism:Homo sapiens (Human)
Description:P50281
Residue:582
BDBM50309147
NameBDBM50309147
Synonyms:(2R,3R)-4-(2-(3-chlorophenyl)pyrrolidin-1-yl)-2,3-dihydroxy-4-oxo-N-(2-(thiophen-2-yl)ethyl)butanamide | CHEMBL590343
TypeSmall organic molecule
Emp. Form.C20H23ClN2O4S
Mol. Mass.422.926
SMILESO[C@H]([C@@H](O)C(=O)N1CCCC1c1cccc(Cl)c1)C(=O)NCCc1cccs1