Reaction Details
TargetDisintegrin and metalloproteinase domain-containing protein 17
LigandBDBM50309139
Substrate/Competitorn/a
Meas. Tech.ChEMBL_608472 (CHEMBL1065133)
Ki 1020±n/a nM
Citation Rosner, KEGuo, ZOrth, PShipps, GWBelanger, DBChan, TYCurran, PJDai, CDeng, YGirijavallabhan, VMHong, LLavey, BJLee, JFLi, DLiu, ZPopovici-Muller, JTing, PCVaccaro, HWang, LWang, TYu, WZhou, GNiu, XSun, JKozlowski, JALundell, DJMadison, VMcKittrick, BPiwinski, JJShih, NYArshad Siddiqui, MStrickland, CO The discovery of novel tartrate-based TNF-alpha converting enzyme (TACE) inhibitors. Bioorg Med Chem Lett20:1189-93 (2010) 
 
Disintegrin and metalloproteinase domain-containing protein 17
Name:Disintegrin and metalloproteinase domain-containing protein 17
Type:Enzyme
Mol. Mass.:93007.89
Organism:Homo sapiens (Human)
Description:
Residue:824
BDBM50309139
NameBDBM50309139
Synonyms:(2R,3R)-N1-(furan-2-ylmethyl)-2,3-dihydroxy-N1-methyl-N4-(2-(thiophen-2-yl)ethyl)succinamide | CHEMBL604458
TypeSmall organic molecule
Emp. Form.C16H20N2O5S
Mol. Mass.352.405
SMILESCN(Cc1ccco1)C(=O)[C@H](O)[C@@H](O)C(=O)NCCc1cccs1