Reaction Details
TargetDisintegrin and metalloproteinase domain-containing protein 17
LigandBDBM50309158
Substrate/Competitorn/a
Meas. Tech.ChEMBL_608472 (CHEMBL1065133)
Ki 8±n/a nM
Citation Rosner, KEGuo, ZOrth, PShipps, GWBelanger, DBChan, TYCurran, PJDai, CDeng, YGirijavallabhan, VMHong, LLavey, BJLee, JFLi, DLiu, ZPopovici-Muller, JTing, PCVaccaro, HWang, LWang, TYu, WZhou, GNiu, XSun, JKozlowski, JALundell, DJMadison, VMcKittrick, BPiwinski, JJShih, NYArshad Siddiqui, MStrickland, CO The discovery of novel tartrate-based TNF-alpha converting enzyme (TACE) inhibitors. Bioorg Med Chem Lett20:1189-93 (2010) 
 
Disintegrin and metalloproteinase domain-containing protein 17
Name:Disintegrin and metalloproteinase domain-containing protein 17
Type:Enzyme
Mol. Mass.:93007.89
Organism:Homo sapiens (Human)
Description:
Residue:824
BDBM50309158
NameBDBM50309158
Synonyms:(2R,3R)-N-((4-benzylthiazol-2-yl)methyl)-2,3-dihydroxy-4-oxo-4-(2-phenylpyrrolidin-1-yl)butanamide | CHEMBL592052
TypeSmall organic molecule
Emp. Form.C25H27N3O4S
Mol. Mass.465.565
SMILESO[C@H]([C@@H](O)C(=O)N1CCCC1c1ccccc1)C(=O)NCc1nc(Cc2ccccc2)cs1