Reaction Details
TargetInterstitial collagenase
LigandBDBM50309154
Substrate/Competitorn/a
Meas. Tech.ChEMBL_608474 (CHEMBL1065135)
Ki>50000±n/a nM
Citation Rosner, KEGuo, ZOrth, PShipps, GWBelanger, DBChan, TYCurran, PJDai, CDeng, YGirijavallabhan, VMHong, LLavey, BJLee, JFLi, DLiu, ZPopovici-Muller, JTing, PCVaccaro, HWang, LWang, TYu, WZhou, GNiu, XSun, JKozlowski, JALundell, DJMadison, VMcKittrick, BPiwinski, JJShih, NYArshad Siddiqui, MStrickland, CO The discovery of novel tartrate-based TNF-alpha converting enzyme (TACE) inhibitors. Bioorg Med Chem Lett20:1189-93 (2010) 
 
Interstitial collagenase
Name:Interstitial collagenase
Type:Enzyme
Mol. Mass.:54010.26
Organism:Homo sapiens (Human)
Description: P03956
Residue:469
BDBM50309154
NameBDBM50309154
Synonyms:(2R,3R)-N-(2-(4-benzylthiophen-2-yl)ethyl)-2,3-dihydroxy-4-oxo-4-(2-phenylpyrrolidin-1-yl)butanamide | CHEMBL602949
TypeSmall organic molecule
Emp. Form.C27H30N2O4S
Mol. Mass.478.603
SMILESO[C@H]([C@@H](O)C(=O)N1CCCC1c1ccccc1)C(=O)NCCc1cc(Cc2ccccc2)cs1