Reaction Details
TargetStromelysin-1
LigandBDBM50309132
Substrate/Competitorn/a
Meas. Tech.ChEMBL_608476 (CHEMBL1065137)
Ki>50000±n/a nM
Citation Rosner, KEGuo, ZOrth, PShipps, GWBelanger, DBChan, TYCurran, PJDai, CDeng, YGirijavallabhan, VMHong, LLavey, BJLee, JFLi, DLiu, ZPopovici-Muller, JTing, PCVaccaro, HWang, LWang, TYu, WZhou, GNiu, XSun, JKozlowski, JALundell, DJMadison, VMcKittrick, BPiwinski, JJShih, NYArshad Siddiqui, MStrickland, CO The discovery of novel tartrate-based TNF-alpha converting enzyme (TACE) inhibitors. Bioorg Med Chem Lett20:1189-93 (2010) 
 
Stromelysin-1
Name:Stromelysin-1
Type:Enzyme
Mol. Mass.:53973.13
Organism:Homo sapiens (Human)
Description: P08254
Residue:477
BDBM50309132
NameBDBM50309132
Synonyms:(2R,3R)-4-(4-(2-chlorophenyl)piperazin-1-yl)-2,3-dihydroxy-4-oxo-N-(2-(thiophen-2-yl)ethyl)butanamide CHEMBL605764
TypeSmall organic molecule
Emp. Form.C20H24ClN3O4S
Mol. Mass.437.94
SMILESO[C@H]([C@@H](O)C(=O)N1CCN(CC1)c1ccccc1Cl)C(=O)NCCc1cccs1