Reaction Details
TargetRibosyldihydronicotinamide dehydrogenase [quinone]
LigandBDBM50309775
Substrate/Competitorn/a
Meas. Tech.ChEMBL_610872 (CHEMBL1065027)
IC50 427±n/a nM
Citation Nolan, KAHumphries, MPBarnes, JDoncaster, JRCaraher, MCTirelli, NBryce, RAWhitehead, RCStratford, IJ Triazoloacridin-6-ones as novel inhibitors of the quinone oxidoreductases NQO1 and NQO2. Bioorg Med Chem18:696-706 (2010) 
 
Ribosyldihydronicotinamide dehydrogenase [quinone]
Name:Ribosyldihydronicotinamide dehydrogenase [quinone]
Type:Protein
Mol. Mass.:25917.25
Organism:Homo sapiens (Human)
Description:P16083
Residue:231
BDBM50309775
NameBDBM50309775
Synonyms:5-(isopentylamino)-6H-[1,2,3]triazolo[4,5,1-de]acridin-6-one | CHEMBL599688
TypeSmall organic molecule
Emp. Form.C18H18N4O
Mol. Mass.306.3617
SMILESCC(C)CCNc1ccc2nnn3c2c1c(=O)c1ccccc31