Reaction Details
TargetcAMP-specific 3',5'-cyclic phosphodiesterase 4D
LigandBDBM50310204
Substrate/Competitorn/a
Meas. Tech.ChEMBL_607913 (CHEMBL1066241)
IC50 27±n/a nM
Citation Kim, ISong, JHPark, CMJeong, JWKim, HRHa, JRNo, ZHyun, YLCho, YSSook Kang, NJeon, DJ Design, synthesis, and evaluation of 2-aryl-7-(3',4'-dialkoxyphenyl)-pyrazolo[1,5-a]pyrimidines as novel PDE-4 inhibitors. Bioorg Med Chem Lett20:922-6 (2010) 
 
cAMP-specific 3',5'-cyclic phosphodiesterase 4D
Name:cAMP-specific 3',5'-cyclic phosphodiesterase 4D
Type:Protein
Mol. Mass.:91092.69
Organism:Homo sapiens (Human)
Description:Q08499
Residue:809
BDBM50310204
NameBDBM50310204
Synonyms:7-(3'-Cyclopropylmethoxy-4'-difluoromethoxyphenyl)-2-pyridin-3-yl-pyrazolo[1,5-a]pyrimidine | CHEMBL604519
TypeSmall organic molecule
Emp. Form.C22H18F2N4O2
Mol. Mass.408.4007
SMILESFC(F)Oc1ccc(cc1OCC1CC1)-c1ccnc2cc(nn12)-c1cccnc1