Reaction Details
TargetRho-associated protein kinase 1
LigandBDBM50310470
Substrate/Competitorn/a
Meas. Tech.ChEMBL_619401 (CHEMBL1104159)
Ki 85±n/a nM
Citation Bandarage, UHare, BParsons, JPham, LMarhefka, CBemis, GTang, QMoody, CSRodems, SShah, SAdams, CBravo, JCharonnet, ESavic, VCome, JHGreen, J 4-(Benzimidazol-2-yl)-1,2,5-oxadiazol-3-ylamine derivatives: potent and selective p70S6 kinase inhibitors. Bioorg Med Chem Lett19:5191-4 (2009) 
 
Rho-associated protein kinase 1
Name:Rho-associated protein kinase 1
Type:Serine/threonine-protein kinase
Mol. Mass.:158156.77
Organism:Homo sapiens (Human)
Description:Q13464
Residue:1354
BDBM50310470
NameBDBM50310470
Synonyms:4-(5-amino-1-cyclobutyl-1H-benzo[d]imidazol-2-yl)-1,2,5-oxadiazol-3-amine | CHEMBL1080071
TypeSmall organic molecule
Emp. Form.C13H14N6O
Mol. Mass.270.2899
SMILESNc1nonc1-c1nc2cc(N)ccc2n1C1CCC1