Reaction Details
TargetCytochrome P450 3A4
LigandBDBM50310766
Substrate/Competitorn/a
Meas. Tech.ChEMBL_621465 (CHEMBL1100026)
IC50 66±n/a nM
Citation Flentge, CARandolph, JTHuang, PPKlein, LLMarsh, KCHarlan, JEKempf, DJ Synthesis and evaluation of inhibitors of cytochrome P450 3A (CYP3A) for pharmacokinetic enhancement of drugs. Bioorg Med Chem Lett19:5444-8 (2009) 
 
Cytochrome P450 3A4
Name:Cytochrome P450 3A4
Type:Enzyme
Mol. Mass.:57349.57
Organism:Homo sapiens (Human)
Description:n/a
Residue:503
BDBM50310766
NameBDBM50310766
Synonyms:Bis-N-[(S)-2-(thiazol-5-ylmethoxycarbonylamino)-3-phenylpropyl]-N-[3-pyridylmethyl]amine | CHEMBL1077938
TypeSmall organic molecule
Emp. Form.C34H36N6O4S2
Mol. Mass.656.817
SMILESO=C(N[C@H](CN(C[C@H](Cc1ccccc1)NC(=O)OCc1nccs1)Cc1cccnc1)Cc1ccccc1)OCc1cncs1