Reaction Details
TargetCytochrome P450 3A4
LigandBDBM50310782
Substrate/Competitorn/a
Meas. Tech.ChEMBL_621465 (CHEMBL1100026)
IC50 741±n/a nM
Citation Flentge, CARandolph, JTHuang, PPKlein, LLMarsh, KCHarlan, JEKempf, DJ Synthesis and evaluation of inhibitors of cytochrome P450 3A (CYP3A) for pharmacokinetic enhancement of drugs. Bioorg Med Chem Lett19:5444-8 (2009) 
 
Cytochrome P450 3A4
Name:Cytochrome P450 3A4
Type:Enzyme
Mol. Mass.:57349.57
Organism:Homo sapiens (Human)
Description:n/a
Residue:503
BDBM50310782
NameBDBM50310782
Synonyms:Bis-N-[(S)-2-(thien-2-ylmethoxycarbonylamino)-3-phenylpropyl]ethylamine | CHEMBL1080603
TypeSmall organic molecule
Emp. Form.C32H37N3O4S2
Mol. Mass.591.784
SMILESCCN(C[C@H](Cc1ccccc1)NC(=O)OCc1cccs1)C[C@H](Cc1ccccc1)NC(=O)OCc1cccs1