Reaction Details
TargetCytochrome P450 3A4
LigandBDBM50310784
Substrate/Competitorn/a
Meas. Tech.ChEMBL_621465 (CHEMBL1100026)
IC50>300±n/a nM
Citation Flentge, CARandolph, JTHuang, PPKlein, LLMarsh, KCHarlan, JEKempf, DJ Synthesis and evaluation of inhibitors of cytochrome P450 3A (CYP3A) for pharmacokinetic enhancement of drugs. Bioorg Med Chem Lett19:5444-8 (2009) 
 
Cytochrome P450 3A4
Name:Cytochrome P450 3A4
Type:Enzyme
Mol. Mass.:57349.57
Organism:Homo sapiens (Human)
Description:n/a
Residue:503
BDBM50310784
NameBDBM50310784
Synonyms:Bis-N-[(S)-2-(pyrazol-4-ylmethoxycarbonylamino)-3-phenylpropyl]ethylamine | CHEMBL1080604
TypeSmall organic molecule
Emp. Form.C30H37N7O4
Mol. Mass.559.6593
SMILESCCN(C[C@H](Cc1ccccc1)NC(=O)OCc1cn[nH]c1)C[C@H](Cc1ccccc1)NC(=O)OCc1cn[nH]c1