Reaction Details
TargetDeoxycytidine kinase
LigandBDBM50311540
Substrate/Competitorn/a
Meas. Tech.ChEMBL_618319 (CHEMBL1101183)
IC50 120000±n/a nM
Citation Tarver, JEJessop, TCCarlsen, MAugeri, DJFu, QHealy, JPHeim-Riether, AXu, ATaylor, JAShen, MKeyes, PEDavid Kimball, SYu, XCMiranda, MLiu, QSwaffield, JCNouraldeen, AWilson, AGFinch, RJhaver, KFoushee, AMAnderson, SOravecz, TCarson, KG 5-Fluorocytosine derivatives as inhibitors of deoxycytidine kinase. Bioorg Med Chem Lett19:6780-3 (2009) 
 
Deoxycytidine kinase
Name:Deoxycytidine kinase
Type:PROTEIN
Mol. Mass.:30510.65
Organism:Homo sapiens (Human)
Description:ChEMBL_1437135
Residue:260
BDBM50311540
NameBDBM50311540
Synonyms:2'-deoxy-5-fluorocytidine CHEMBL1076257
TypeSmall organic molecule
Emp. Form.C9H12FN3O4
Mol. Mass.245.2077
SMILESNc1nc(=O)n(cc1F)[C@H]1C[C@H](O)[C@@H](CO)O1