Reaction Details
TargetDeoxycytidine kinase
LigandBDBM50311542
Substrate/Competitorn/a
Meas. Tech.ChEMBL_618319 (CHEMBL1101183)
IC50 38±n/a nM
Citation Tarver, JEJessop, TCCarlsen, MAugeri, DJFu, QHealy, JPHeim-Riether, AXu, ATaylor, JAShen, MKeyes, PEDavid Kimball, SYu, XCMiranda, MLiu, QSwaffield, JCNouraldeen, AWilson, AGFinch, RJhaver, KFoushee, AMAnderson, SOravecz, TCarson, KG 5-Fluorocytosine derivatives as inhibitors of deoxycytidine kinase. Bioorg Med Chem Lett19:6780-3 (2009) 
 
Deoxycytidine kinase
Name:Deoxycytidine kinase
Type:PROTEIN
Mol. Mass.:30510.65
Organism:Homo sapiens (Human)
Description:ChEMBL_1437135
Residue:260
BDBM50311542
NameBDBM50311542
Synonyms:2-(1-(6-(benzo[b]thiophen-2-yl)pyrimidin-4-yl)piperidin-4-yloxy)-5-fluoropyrimidin-4-amine | CHEMBL1081561
TypeSmall organic molecule
Emp. Form.C21H19FN6OS
Mol. Mass.422.479
SMILESNc1nc(OC2CCN(CC2)c2cc(ncn2)-c2cc3ccccc3s2)ncc1F