Reaction Details
TargetDeoxycytidine kinase
LigandBDBM50311545
Substrate/Competitorn/a
Meas. Tech.ChEMBL_618319 (CHEMBL1101183)
IC50 95±n/a nM
Citation Tarver, JEJessop, TCCarlsen, MAugeri, DJFu, QHealy, JPHeim-Riether, AXu, ATaylor, JAShen, MKeyes, PEDavid Kimball, SYu, XCMiranda, MLiu, QSwaffield, JCNouraldeen, AWilson, AGFinch, RJhaver, KFoushee, AMAnderson, SOravecz, TCarson, KG 5-Fluorocytosine derivatives as inhibitors of deoxycytidine kinase. Bioorg Med Chem Lett19:6780-3 (2009) 
 
Deoxycytidine kinase
Name:Deoxycytidine kinase
Type:PROTEIN
Mol. Mass.:30510.65
Organism:Homo sapiens (Human)
Description:ChEMBL_1437135
Residue:260
BDBM50311545
NameBDBM50311545
Synonyms:5-fluoro-2-(1-(6-phenoxypyrimidin-4-yl)piperidin-4-yloxy)pyrimidin-4-amine | CHEMBL1079769
TypeSmall organic molecule
Emp. Form.C19H19FN6O2
Mol. Mass.382.3916
SMILESNc1nc(OC2CCN(CC2)c2cc(Oc3ccccc3)ncn2)ncc1F