Reaction Details
TargetDeoxycytidine kinase
LigandBDBM50311571
Substrate/Competitorn/a
Meas. Tech.ChEMBL_618319 (CHEMBL1101183)
IC50 63±n/a nM
Citation Tarver, JEJessop, TCCarlsen, MAugeri, DJFu, QHealy, JPHeim-Riether, AXu, ATaylor, JAShen, MKeyes, PEDavid Kimball, SYu, XCMiranda, MLiu, QSwaffield, JCNouraldeen, AWilson, AGFinch, RJhaver, KFoushee, AMAnderson, SOravecz, TCarson, KG 5-Fluorocytosine derivatives as inhibitors of deoxycytidine kinase. Bioorg Med Chem Lett19:6780-3 (2009) 
 
Deoxycytidine kinase
Name:Deoxycytidine kinase
Type:PROTEIN
Mol. Mass.:30510.65
Organism:Homo sapiens (Human)
Description:ChEMBL_1437135
Residue:260
BDBM50311571
NameBDBM50311571
Synonyms:2-(6-(4-(4-amino-2-oxopyrimidin-1(2H)-yloxy)piperidin-1-yl)-5-fluoropyrimidin-4-yloxy)benzonitrile | CHEMBL1080829
TypeSmall organic molecule
Emp. Form.C20H18FN7O3
Mol. Mass.423.4004
SMILESNc1ccn(OC2CCN(CC2)c2ncnc(Oc3ccccc3C#N)c2F)c(=O)n1