Reaction Details
TargetDeoxycytidine kinase
LigandBDBM50311539
Substrate/Competitorn/a
Meas. Tech.ChEMBL_618320 (CHEMBL1101184)
IC50>4000±n/a nM
Citation Tarver, JEJessop, TCCarlsen, MAugeri, DJFu, QHealy, JPHeim-Riether, AXu, ATaylor, JAShen, MKeyes, PEDavid Kimball, SYu, XCMiranda, MLiu, QSwaffield, JCNouraldeen, AWilson, AGFinch, RJhaver, KFoushee, AMAnderson, SOravecz, TCarson, KG 5-Fluorocytosine derivatives as inhibitors of deoxycytidine kinase. Bioorg Med Chem Lett19:6780-3 (2009) 
 
Deoxycytidine kinase
Name:Deoxycytidine kinase
Type:PROTEIN
Mol. Mass.:30510.65
Organism:Homo sapiens (Human)
Description:ChEMBL_1437135
Residue:260
BDBM50311539
NameBDBM50311539
Synonyms:2-(4-(6-(benzo[b]thiophen-2-yl)pyrimidin-4-yl)piperazin-1-yl)-1-(pyrrolidin-1-yl)ethanone CHEMBL1081559
TypeSmall organic molecule
Emp. Form.C22H25N5OS
Mol. Mass.407.532
SMILESO=C(CN1CCN(CC1)c1cc(ncn1)-c1cc2ccccc2s1)N1CCCC1