Reaction Details
TargetDeoxycytidine kinase
LigandBDBM50311544
Substrate/Competitorn/a
Meas. Tech.ChEMBL_618320 (CHEMBL1101184)
EC50 160±n/a nM
Citation Tarver, JEJessop, TCCarlsen, MAugeri, DJFu, QHealy, JPHeim-Riether, AXu, ATaylor, JAShen, MKeyes, PEDavid Kimball, SYu, XCMiranda, MLiu, QSwaffield, JCNouraldeen, AWilson, AGFinch, RJhaver, KFoushee, AMAnderson, SOravecz, TCarson, KG 5-Fluorocytosine derivatives as inhibitors of deoxycytidine kinase. Bioorg Med Chem Lett19:6780-3 (2009) 
 
Deoxycytidine kinase
Name:Deoxycytidine kinase
Type:PROTEIN
Mol. Mass.:30510.65
Organism:Homo sapiens (Human)
Description:ChEMBL_1437135
Residue:260
BDBM50311544
NameBDBM50311544
Synonyms:2-(2-(1-(6-(benzo[b]thiophen-2-yl)pyrimidin-4-yl)piperidin-4-yl)ethoxy)-5-fluoropyrimidin-4-amine | CHEMBL1079768
TypeSmall organic molecule
Emp. Form.C23H23FN6OS
Mol. Mass.450.532
SMILESNc1nc(OCCC2CCN(CC2)c2cc(ncn2)-c2cc3ccccc3s2)ncc1F