Reaction Details
TargetDeoxycytidine kinase
LigandBDBM50311550
Substrate/Competitorn/a
Meas. Tech.ChEMBL_618320 (CHEMBL1101184)
EC50 19±n/a nM
Citation Tarver, JEJessop, TCCarlsen, MAugeri, DJFu, QHealy, JPHeim-Riether, AXu, ATaylor, JAShen, MKeyes, PEDavid Kimball, SYu, XCMiranda, MLiu, QSwaffield, JCNouraldeen, AWilson, AGFinch, RJhaver, KFoushee, AMAnderson, SOravecz, TCarson, KG 5-Fluorocytosine derivatives as inhibitors of deoxycytidine kinase. Bioorg Med Chem Lett19:6780-3 (2009) 
 
Deoxycytidine kinase
Name:Deoxycytidine kinase
Type:PROTEIN
Mol. Mass.:30510.65
Organism:Homo sapiens (Human)
Description:ChEMBL_1437135
Residue:260
BDBM50311550
NameBDBM50311550
Synonyms:5-fluoro-2-(1-(6-(o-tolyloxy)pyrimidin-4-yl)piperidin-4-yloxy)pyrimidin-4-amine | CHEMBL1079603
TypeSmall organic molecule
Emp. Form.C20H21FN6O2
Mol. Mass.396.4181
SMILESCc1ccccc1Oc1cc(ncn1)N1CCC(CC1)Oc1ncc(F)c(N)n1