Reaction Details
TargetDeoxycytidine kinase
LigandBDBM50311551
Substrate/Competitorn/a
Meas. Tech.ChEMBL_618320 (CHEMBL1101184)
EC50 26±n/a nM
Citation Tarver, JEJessop, TCCarlsen, MAugeri, DJFu, QHealy, JPHeim-Riether, AXu, ATaylor, JAShen, MKeyes, PEDavid Kimball, SYu, XCMiranda, MLiu, QSwaffield, JCNouraldeen, AWilson, AGFinch, RJhaver, KFoushee, AMAnderson, SOravecz, TCarson, KG 5-Fluorocytosine derivatives as inhibitors of deoxycytidine kinase. Bioorg Med Chem Lett19:6780-3 (2009) 
 
Deoxycytidine kinase
Name:Deoxycytidine kinase
Type:PROTEIN
Mol. Mass.:30510.65
Organism:Homo sapiens (Human)
Description:ChEMBL_1437135
Residue:260
BDBM50311551
NameBDBM50311551
Synonyms:2-(1-(6-(biphenyl-2-yloxy)pyrimidin-4-yl)piperidin-4-yloxy)-5-fluoropyrimidin-4-amine | CHEMBL1081350
TypeSmall organic molecule
Emp. Form.C25H23FN6O2
Mol. Mass.458.4875
SMILESNc1nc(OC2CCN(CC2)c2cc(Oc3ccccc3-c3ccccc3)ncn2)ncc1F