Reaction Details
TargetDeoxycytidine kinase
LigandBDBM50311552
Substrate/Competitorn/a
Meas. Tech.ChEMBL_618320 (CHEMBL1101184)
EC50 57±n/a nM
Citation Tarver, JEJessop, TCCarlsen, MAugeri, DJFu, QHealy, JPHeim-Riether, AXu, ATaylor, JAShen, MKeyes, PEDavid Kimball, SYu, XCMiranda, MLiu, QSwaffield, JCNouraldeen, AWilson, AGFinch, RJhaver, KFoushee, AMAnderson, SOravecz, TCarson, KG 5-Fluorocytosine derivatives as inhibitors of deoxycytidine kinase. Bioorg Med Chem Lett19:6780-3 (2009) 
 
Deoxycytidine kinase
Name:Deoxycytidine kinase
Type:PROTEIN
Mol. Mass.:30510.65
Organism:Homo sapiens (Human)
Description:ChEMBL_1437135
Residue:260
BDBM50311552
NameBDBM50311552
Synonyms:2-(1-(6-(4-chlorophenoxy)pyrimidin-4-yl)piperidin-4-yloxy)-5-fluoropyrimidin-4-amine | CHEMBL1081351
TypeSmall organic molecule
Emp. Form.C19H18ClFN6O2
Mol. Mass.416.837
SMILESNc1nc(OC2CCN(CC2)c2cc(Oc3ccc(Cl)cc3)ncn2)ncc1F