Reaction Details
TargetDeoxycytidine kinase
LigandBDBM50311556
Substrate/Competitorn/a
Meas. Tech.ChEMBL_618320 (CHEMBL1101184)
EC50 14±n/a nM
Citation Tarver, JEJessop, TCCarlsen, MAugeri, DJFu, QHealy, JPHeim-Riether, AXu, ATaylor, JAShen, MKeyes, PEDavid Kimball, SYu, XCMiranda, MLiu, QSwaffield, JCNouraldeen, AWilson, AGFinch, RJhaver, KFoushee, AMAnderson, SOravecz, TCarson, KG 5-Fluorocytosine derivatives as inhibitors of deoxycytidine kinase. Bioorg Med Chem Lett19:6780-3 (2009) 
 
Deoxycytidine kinase
Name:Deoxycytidine kinase
Type:PROTEIN
Mol. Mass.:30510.65
Organism:Homo sapiens (Human)
Description:ChEMBL_1437135
Residue:260
BDBM50311556
NameBDBM50311556
Synonyms:2-(6-(4-(4-amino-5-fluoropyrimidin-2-yloxy)piperidin-1-yl)pyrimidin-4-yloxy)benzonitrile | CHEMBL1079906
TypeSmall organic molecule
Emp. Form.C20H18FN7O2
Mol. Mass.407.401
SMILESNc1nc(OC2CCN(CC2)c2cc(Oc3ccccc3C#N)ncn2)ncc1F