Reaction Details
TargetDeoxycytidine kinase
LigandBDBM50311561
Substrate/Competitorn/a
Meas. Tech.ChEMBL_618320 (CHEMBL1101184)
EC50 54±n/a nM
Citation Tarver, JEJessop, TCCarlsen, MAugeri, DJFu, QHealy, JPHeim-Riether, AXu, ATaylor, JAShen, MKeyes, PEDavid Kimball, SYu, XCMiranda, MLiu, QSwaffield, JCNouraldeen, AWilson, AGFinch, RJhaver, KFoushee, AMAnderson, SOravecz, TCarson, KG 5-Fluorocytosine derivatives as inhibitors of deoxycytidine kinase. Bioorg Med Chem Lett19:6780-3 (2009) 
 
Deoxycytidine kinase
Name:Deoxycytidine kinase
Type:PROTEIN
Mol. Mass.:30510.65
Organism:Homo sapiens (Human)
Description:ChEMBL_1437135
Residue:260
BDBM50311561
NameBDBM50311561
Synonyms:2-(6-(4-(4-amino-5-fluoropyrimidin-2-yloxy)piperidin-1-yl)-5-methylpyrimidin-4-yloxy)benzonitrile | CHEMBL1080817
TypeSmall organic molecule
Emp. Form.C21H20FN7O2
Mol. Mass.421.4276
SMILESCc1c(Oc2ccccc2C#N)ncnc1N1CCC(CC1)Oc1ncc(F)c(N)n1