Reaction Details
TargetDeoxycytidine kinase
LigandBDBM50311565
Substrate/Competitorn/a
Meas. Tech.ChEMBL_618320 (CHEMBL1101184)
EC50 14±n/a nM
Citation Tarver, JEJessop, TCCarlsen, MAugeri, DJFu, QHealy, JPHeim-Riether, AXu, ATaylor, JAShen, MKeyes, PEDavid Kimball, SYu, XCMiranda, MLiu, QSwaffield, JCNouraldeen, AWilson, AGFinch, RJhaver, KFoushee, AMAnderson, SOravecz, TCarson, KG 5-Fluorocytosine derivatives as inhibitors of deoxycytidine kinase. Bioorg Med Chem Lett19:6780-3 (2009) 
 
Deoxycytidine kinase
Name:Deoxycytidine kinase
Type:PROTEIN
Mol. Mass.:30510.65
Organism:Homo sapiens (Human)
Description:ChEMBL_1437135
Residue:260
BDBM50311565
NameBDBM50311565
Synonyms:5-fluoro-2-(1-(5-fluoro-6-(4-methoxyphenoxy)pyrimidin-4-yl)piperidin-4-yloxy)pyrimidin-4-amine | CHEMBL1079379
TypeSmall organic molecule
Emp. Form.C20H20F2N6O3
Mol. Mass.430.408
SMILESCOc1ccc(Oc2ncnc(N3CCC(CC3)Oc3ncc(F)c(N)n3)c2F)cc1