Reaction Details
TargetDeoxycytidine kinase
LigandBDBM50311569
Substrate/Competitorn/a
Meas. Tech.ChEMBL_618320 (CHEMBL1101184)
EC50 5±n/a nM
Citation Tarver, JEJessop, TCCarlsen, MAugeri, DJFu, QHealy, JPHeim-Riether, AXu, ATaylor, JAShen, MKeyes, PEDavid Kimball, SYu, XCMiranda, MLiu, QSwaffield, JCNouraldeen, AWilson, AGFinch, RJhaver, KFoushee, AMAnderson, SOravecz, TCarson, KG 5-Fluorocytosine derivatives as inhibitors of deoxycytidine kinase. Bioorg Med Chem Lett19:6780-3 (2009) 
 
Deoxycytidine kinase
Name:Deoxycytidine kinase
Type:PROTEIN
Mol. Mass.:30510.65
Organism:Homo sapiens (Human)
Description:ChEMBL_1437135
Residue:260
BDBM50311569
NameBDBM50311569
Synonyms:2-(6-(4-(4-amino-5-fluoropyrimidin-2-yloxy)piperidin-1-yl)-5-fluoropyrimidin-4-yloxy)-5-methoxybenzonitrile | CHEMBL1081904
TypeSmall organic molecule
Emp. Form.C21H19F2N7O3
Mol. Mass.455.4175
SMILESCOc1ccc(Oc2ncnc(N3CCC(CC3)Oc3ncc(F)c(N)n3)c2F)c(c1)C#N