Reaction Details
TargetTyrosine-protein kinase JAK3
LigandBDBM50311655
Substrate/Competitorn/a
Meas. Tech.ChEMBL_618677 (CHEMBL1102455)
IC50 15±n/a nM
Citation Cole, AGBohnstedt, ACParadkar, VKingsbury, CQuintero, JGPark, HLu, YYou, MNeagu, IDiller, DJLetourneau, JJShao, YJames, RARiviello, CMHo, KKLin, THWang, BAppell, KCSills, MQuadros, EKimble, EFOhlmeyer, MHWebb, ML 2-Benzimidazolyl-9-(chroman-4-yl)-purinone derivatives as JAK3 inhibitors. Bioorg Med Chem Lett19:6788-92 (2009) 
 
Tyrosine-protein kinase JAK3
Name:Tyrosine-protein kinase JAK3
Type:Protein
Mol. Mass.:125111.08
Organism:Homo sapiens (Human)
Description:P52333
Residue:1124
BDBM50311655
NameBDBM50311655
Synonyms:2-(6-chloro-1H-benzo[d]imidazol-1-yl)-9-(8-fluorochroman-4-yl)-7H-purin-8(9H)-one | CHEMBL1081379
TypeSmall organic molecule
Emp. Form.C21H14ClFN6O2
Mol. Mass.436.826
SMILESFc1cccc2[C@@H](CCOc12)n1c2nc(ncc2[nH]c1=O)-n1cnc2ccc(Cl)cc12