Reaction Details
TargetTyrosine-protein kinase JAK2
LigandBDBM50311642
Substrate/Competitorn/a
Meas. Tech.ChEMBL_618678 (CHEMBL1102456)
IC50 270±n/a nM
Citation Cole, AGBohnstedt, ACParadkar, VKingsbury, CQuintero, JGPark, HLu, YYou, MNeagu, IDiller, DJLetourneau, JJShao, YJames, RARiviello, CMHo, KKLin, THWang, BAppell, KCSills, MQuadros, EKimble, EFOhlmeyer, MHWebb, ML 2-Benzimidazolyl-9-(chroman-4-yl)-purinone derivatives as JAK3 inhibitors. Bioorg Med Chem Lett19:6788-92 (2009) 
 
Tyrosine-protein kinase JAK2
Name:Tyrosine-protein kinase JAK2
Type:Protein
Mol. Mass.:130684.68
Organism:Homo sapiens (Human)
Description:O60674
Residue:1132
BDBM50311642
NameBDBM50311642
Synonyms:1-(9-(2,3-difluorobenzyl)-8-oxo-8,9-dihydro-7H-purin-2-yl)-1H-benzo[d]imidazole-6-carbonitrile | CHEMBL1080332
TypeSmall organic molecule
Emp. Form.C20H11F2N7O
Mol. Mass.403.3444
SMILESFc1cccc(Cn2c3nc(ncc3[nH]c2=O)-n2cnc3ccc(cc23)C#N)c1F