Reaction Details
TargetTyrosine-protein kinase JAK2
LigandBDBM50311648
Substrate/Competitorn/a
Meas. Tech.ChEMBL_618678 (CHEMBL1102456)
IC50 83±n/a nM
Citation Cole, AGBohnstedt, ACParadkar, VKingsbury, CQuintero, JGPark, HLu, YYou, MNeagu, IDiller, DJLetourneau, JJShao, YJames, RARiviello, CMHo, KKLin, THWang, BAppell, KCSills, MQuadros, EKimble, EFOhlmeyer, MHWebb, ML 2-Benzimidazolyl-9-(chroman-4-yl)-purinone derivatives as JAK3 inhibitors. Bioorg Med Chem Lett19:6788-92 (2009) 
 
Tyrosine-protein kinase JAK2
Name:Tyrosine-protein kinase JAK2
Type:Protein
Mol. Mass.:130684.68
Organism:Homo sapiens (Human)
Description:O60674
Residue:1132
BDBM50311648
NameBDBM50311648
Synonyms:(+/-)-2-(1H-benzo[d]imidazol-1-yl)-9-(6-fluorochroman-4-yl)-7H-purin-8(9H)-one | CHEMBL1081190
TypeSmall organic molecule
Emp. Form.C21H15FN6O2
Mol. Mass.402.3812
SMILESFc1ccc2OCCC(c2c1)n1c2nc(ncc2[nH]c1=O)-n1cnc2ccccc12