Reaction Details
TargetTyrosine-protein kinase JAK2
LigandBDBM50311656
Substrate/Competitorn/a
Meas. Tech.ChEMBL_618678 (CHEMBL1102456)
IC50 26±n/a nM
Citation Cole, AGBohnstedt, ACParadkar, VKingsbury, CQuintero, JGPark, HLu, YYou, MNeagu, IDiller, DJLetourneau, JJShao, YJames, RARiviello, CMHo, KKLin, THWang, BAppell, KCSills, MQuadros, EKimble, EFOhlmeyer, MHWebb, ML 2-Benzimidazolyl-9-(chroman-4-yl)-purinone derivatives as JAK3 inhibitors. Bioorg Med Chem Lett19:6788-92 (2009) 
 
Tyrosine-protein kinase JAK2
Name:Tyrosine-protein kinase JAK2
Type:Protein
Mol. Mass.:130684.68
Organism:Homo sapiens (Human)
Description:O60674
Residue:1132
BDBM50311656
NameBDBM50311656
Synonyms:2-(6-fluoro-1H-benzo[d]imidazol-1-yl)-9-(8-fluorochroman-4-yl)-7H-purin-8(9H)-one | CHEMBL1079593
TypeSmall organic molecule
Emp. Form.C21H14F2N6O2
Mol. Mass.420.3717
SMILESFc1ccc2ncn(-c3ncc4[nH]c(=O)n([C@@H]5CCOc6c(F)cccc56)c4n3)c2c1