Reaction Details
TargetPeroxisome proliferator-activated receptor delta
LigandBDBM50311791
Substrate/Competitorn/a
Meas. Tech.ChEMBL_619896 (CHEMBL1110286)
IC50 68±n/a nM
Citation Kasuga, JIshida, SYamasaki, DMakishima, MDoi, THashimoto, YMiyachi, H Novel biphenylcarboxylic acid peroxisome proliferator-activated receptor (PPAR) delta selective antagonists. Bioorg Med Chem Lett19:6595-9 (2009) 
 
Peroxisome proliferator-activated receptor delta
Name:Peroxisome proliferator-activated receptor delta
Type:Enzyme
Mol. Mass.:49910.45
Organism:Homo sapiens (Human)
Description:Q03181
Residue:441
BDBM50311791
NameBDBM50311791
Synonyms:4'-butoxy-3'-((2-fluoro-4-(trifluoromethyl)benzamido)methyl)biphenyl-4-carboxylic acid | CHEMBL1080469
TypeSmall organic molecule
Emp. Form.C26H23F4NO4
Mol. Mass.489.4587
SMILESCCCCOc1ccc(cc1CNC(=O)c1ccc(cc1F)C(F)(F)F)-c1ccc(cc1)C(O)=O